Nextcloud: problem bei deinstallation&installation - docker nie gestartet

Hallo zusammen,

folgende Situation:
Proxmox Server zur Virtualisierung.
UCS 4.4-1 errata287 als VM (4gb RAM, 2 cpus, 30gb HDD) läuft auf dem ProxMox Server.

wenn man nun Nextcloud installiert (über das App Portal) dann wird das zwar “installiert” fürt aber zu einem Fehler da der Docker Container nicht startet. Das Deinstallieren von Nextcloud hat auch Probleme, da es nicht funktioniert da der Docker Container nicht läuft.

kann mir jemand helfen, denn ich möchte mit USB den Microsoft SBS nachbauen und wäre sehr daran interessiert das das funktioniert und ich dann dieses Produkt an die Interessenten bringen könnte.

mfg
Stephan von Gehlen

folgende Log Ausgabe:
-------------snip----------
Press [ENTER] to continue
Creating data directories for nextcloud…
Copying /var/cache/univention-appcenter/appcenter.software-univention. de/4.1/nextcloud_20190820172411.schema
Registering UCR for nextcloud
Marking 4.1/nextcloud=16.0.4-0 as installed
File: /etc/univention/service.info/services/univention-appcenter.cfg
Multifile: /etc/postgresql/9.4/main/pg_hba.conf
Module: kopano-cfg
File: /usr/share/univention-portal/apps.json
Setting ports for apache proxy
Multifile: /etc/apache2/sites-available/000-default.conf
Multifile: /etc/apache2/sites-available/default-ssl.conf
Module: kopano-cfg
Creating /etc/init.d/docker-app-nextcloud
insserv: warning: script ‘K02univention-system-setup-boot’ missing LSB tags and overrides
insserv: warning: script ‘univention-system-setup-boot-prepare’ missing LSB tags and overrides
insserv: warning: script ‘univention-system-setup-boot’ missing LSB tags and overrides
insserv: There is a loop between service logitechmediaserver and univention-system-setup-boot-prepare if stopped
insserv: loop involving service univention-system-setup-boot-prepare at depth 2
insserv: loop involving service logitechmediaserver at depth 1
insserv: Stopping univention-system-setup-boot-prepare depends on logitechmediaserver and therefore on system facility `$all’ which can not be true!
Adding localhost to LDAP object
Setting overview variables
Module: kopano-cfg
Module: create_portal_entries
Reloading apache2 configuration (via systemctl): apache2.service.
univention-postgresql wurde bereits auf manuell installiert gesetzt.
Checking if database nextcloud exists (postgresql implementation)
Database nextcloud already exists
4.1/nextcloud=16.0.4-0 already has its database
Registering schema /usr/share/univention-appcenter/apps/nextcloud/nextcloud.schema
INFO: No change of core data of object nextcloud.
No modification: cn=nextcloud,cn=ldapschema,cn=univention,dc=bracht,dc=von-gehlen,dc=de

WARNING: cannot append nextcloud to appidentifier, value exists
No modification: cn=nextcloud,cn=ldapschema,cn=univention,dc=bracht,dc=von-gehlen,dc=de

Waiting for activation of the extension object nextcloud: OK
Registering the container host nextc-10931535 for nextcloud
Module: kopano-cfg
Verifying Docker registry manifest for app image docker.software-univention. de/nextcloud:16.0.4-0
Downloading app image docker.software-univention. de/nextcloud:16.0.4-0
Login Succeeded
Running command: docker pull docker.software-univention. de/nextcloud:16.0.4-0
16.0.4-0: Pulling from nextcloud
ba5552fa5959: Already exists
209aa19604b2: Already exists
4bd717a56fc0: Already exists
83ff8a05d889: Already exists
3d9c2f10a019: Already exists
c6c6bcde2b06: Already exists
f6ee9edc19ce: Already exists
45d72275c78e: Already exists
9e8266440b6e: Already exists
fab579372455: Already exists
f23cebd28dd0: Already exists
4b48e83098e1: Already exists
0cb08095ede3: Already exists
20b899edd935: Already exists
32d34f6c6f47: Already exists
6aa1c60a40dc: Already exists
83f5ee9131a5: Already exists
828618bc284f: Already exists
f5bf07a6181b: Already exists
704cd173186c: Already exists
Digest: sha256:b1b44fe2ad80dacab9cf99cb7e638053cbabecbe66c6a976fce9be262b78c7ae
Status: Image is up to date for docker.software-univention. de/nextcloud:16.0.4-0
Initializing app image
Running command: docker create --hostname nextc-10931535 --env-file /var/lib/univention-appcenter/apps/nextcloud/nextcloud.env -p 40000:80/tcp -v /var/lib/univention-appcenter/apps/nextcloud/data:/var/lib/univention-appcenter/apps/nextcloud/data -v /etc/apt/apt.conf.d/80proxy:/etc/apt/apt.conf.d/80proxy:ro -v /var/lib/univention-appcenter/apps/nextcloud/conf:/var/lib/univention-appcenter/apps/nextcloud/conf -v /sys/fs/cgroup:/sys/fs/cgroup:ro --tmpfs /run --tmpfs /run/lock --security-opt seccomp:/etc/docker/seccomp-systemd.json -e container=docker docker.software-univention.de/nextcloud:16.0.4-0 /usr/sbin/entrypoint.sh
f395183ad861a15e1dec03666b5ab8399df07c3f0baefe159d13311db4a7231a
Module: kopano-cfg
Preconfiguring container f395183ad861a15e1dec03666b5ab8399df07c3f0baefe159d13311db4a7231a
Starting docker-app-nextcloud (via systemctl): docker-app-nextcloud.service.
Running command: journalctl -n 20 -o short /usr/bin/dockerd
– Logs begin at Mon 2017-10-02 20:30:09 CEST, end at Tue 2019-09-24 06:58:20 CEST. –
Sep 23 23:08:44 svg-ucs1 dockerd[1708]: time=“2019-09-23T23:08:44.303408210+02:00” level=error msg=“Error setting up exec command in container ab58871d0d492c7f0758f8a1c8c7c71a9e7ff22acd94aa04f36ef887726ae635: Container ab58871d0d492c7f0758f8a1c8c7c71a9e7ff22acd94aa04f36ef887726ae635 is not running”
Sep 23 23:08:44 svg-ucs1 dockerd[1708]: time=“2019-09-23T23:08:44.303477684+02:00” level=error msg=“Handler for POST /v1.26/containers/ab58871d0d492c7f0758f8a1c8c7c71a9e7ff22acd94aa04f36ef887726ae635/exec returned error: Container ab58871d0d492c7f0758f8a1c8c7c71a9e7ff22acd94aa04f36ef887726ae635 is not running”
Sep 23 23:11:43 svg-ucs1 dockerd[1708]: time=“2019-09-23T23:11:43.896770259+02:00” level=info msg=“Container 5e28c22836dfca4b7491da727503410f9adf79698d3152316dc39e7c28936d73 failed to exit within 60 seconds of signal 15 - using the force”
Sep 23 23:11:44 svg-ucs1 dockerd[1708]: time=“2019-09-23T23:11:44.049932469+02:00” level=error msg=“Error running exec in container: rpc error: code = 2 desc = oci runtime error: exec failed: container_linux.go:247: starting container process caused “process_linux.go:83: executing setns process caused \“exit status 15\””\n”
Sep 23 23:11:48 svg-ucs1 dockerd[1708]: time=“2019-09-23T23:11:47.999941952+02:00” level=error msg=“Handler for POST /v1.26/containers/5e28c22836dfca4b7491da727503410f9adf79698d3152316dc39e7c28936d73/stop returned error: Container 5e28c22836dfca4b7491da727503410f9adf79698d3152316dc39e7c28936d73 is already stopped”
Sep 23 23:16:43 svg-ucs1 dockerd[1708]: time=“2019-09-23T23:16:43.739434848+02:00” level=error msg=“Error setting up exec command in container ab58871d0d492c7f0758f8a1c8c7c71a9e7ff22acd94aa04f36ef887726ae635: Container ab58871d0d492c7f0758f8a1c8c7c71a9e7ff22acd94aa04f36ef887726ae635 is not running”
Sep 23 23:16:43 svg-ucs1 dockerd[1708]: time=“2019-09-23T23:16:43.739500392+02:00” level=error msg=“Handler for POST /v1.26/containers/ab58871d0d492c7f0758f8a1c8c7c71a9e7ff22acd94aa04f36ef887726ae635/exec returned error: Container ab58871d0d492c7f0758f8a1c8c7c71a9e7ff22acd94aa04f36ef887726ae635 is not running”
Sep 23 23:19:39 svg-ucs1 dockerd[1708]: time=“2019-09-23T23:19:39.565193754+02:00” level=error msg=“Handler for POST /v1.26/containers/ab58871d0d49/stop returned error: Container ab58871d0d49 is already stopped”
Sep 23 23:28:41 svg-ucs1 dockerd[1708]: time=“2019-09-23T23:28:41.281054612+02:00” level=error msg=“Error setting up exec command in container ab58871d0d492c7f0758f8a1c8c7c71a9e7ff22acd94aa04f36ef887726ae635: Container ab58871d0d492c7f0758f8a1c8c7c71a9e7ff22acd94aa04f36ef887726ae635 is not running”
Sep 23 23:28:41 svg-ucs1 dockerd[1708]: time=“2019-09-23T23:28:41.281106021+02:00” level=error msg=“Handler for POST /v1.26/containers/ab58871d0d492c7f0758f8a1c8c7c71a9e7ff22acd94aa04f36ef887726ae635/exec returned error: Container ab58871d0d492c7f0758f8a1c8c7c71a9e7ff22acd94aa04f36ef887726ae635 is not running”
Sep 23 23:29:47 svg-ucs1 dockerd[1708]: time=“2019-09-23T23:29:47.415863983+02:00” level=error msg=“Handler for POST /v1.26/containers/?/start returned error: No such container: ?”
Sep 23 23:38:22 svg-ucs1 dockerd[1708]: time=“2019-09-23T23:38:22.569477628+02:00” level=error msg=“Handler for GET /v1.26/containers/ab58871d0d492c7f0758f8a1c8c7c71a9e7ff22acd94aa04f36ef887726ae635/json returned error: No such container: ab58871d0d492c7f0758f8a1c8c7c71a9e7ff22acd94aa04f36ef887726ae635”
Running command: docker logs f395183ad861a15e1dec03666b5ab8399df07c3f0baefe159d13311db4a7231a
Going to remove Nextcloud (16.0.4-0)
Die Deinstallation von Nextcloud behält Anwendungs- und Nutzdaten bei.

Folgende Artefakte bleiben erhalten:

UCR Variablen

Diese können mit folgendem Befehl auf dem Host zurückgesetzt werden:

ucr unset ucr search --key "^nextcloud" | cut -d ":" -f 1 | grep nextcloud | tr '\n' ' '

Die Datenbank

Mit folgenden Befehlen kann die Datenbank bereinigt werden

su -c “psql -c “drop database nextcloud”” - postgres &&
su -c “dropuser “nextcloud”” - postgres &&
rm /etc/postgresql-nextcloud.secret

Die erste Befehl löscht die Nextcloud Datenbank in Postgres, der zweite
Befehl entfernt den Datenbank-Benutzer. Die Dritte tilgt die
Passwortdatei.

Nextclouds Anwendungsordner

Der Anwendungsordner enthält UCS-spezifische Daten, sowie den Nextcloud
Datenordner. Folgender Befehl löscht den Ordner

rm -Rf “/var/lib/univention-appcenter/apps/nextcloud”
Press [ENTER] to continue
Module: kopano-cfg
Configuring 4.1/nextcloud=16.0.4-0
Stopping docker-app-nextcloud (via systemctl): docker-app-nextcloud.service.
f395183ad861a15e1dec03666b5ab8399df07c3f0baefe159d13311db4a7231a
f395183ad861a15e1dec03666b5ab8399df07c3f0baefe159d13311db4a7231a
insserv: warning: script ‘K02univention-system-setup-boot’ missing LSB tags and overrides
insserv: warning: script ‘univention-system-setup-boot-prepare’ missing LSB tags and overrides
insserv: warning: script ‘univention-system-setup-boot’ missing LSB tags and overrides
insserv: There is a loop between service logitechmediaserver and univention-system-setup-boot-prepare if stopped
insserv: loop involving service univention-system-setup-boot-prepare at depth 2
insserv: loop involving service logitechmediaserver at depth 1
insserv: Stopping univention-system-setup-boot-prepare depends on logitechmediaserver and therefore on system facility `$all’ which can not be true!
Removing localhost from LDAP object
File: /etc/univention/service.info/services/univention-appcenter.cfg
Module: create_portal_entries
Module: kopano-cfg
Multifile: /etc/postgresql/9.4/main/pg_hba.conf
Multifile: /etc/apache2/sites-available/000-default.conf
Multifile: /etc/apache2/sites-available/default-ssl.conf
File: /usr/share/univention-portal/apps.json
Reloading apache2 configuration (via systemctl): apache2.service.
Installing join script /var/cache/univention-appcenter/appcenter.software-univention.de/4.1/nextcloud_20190820172411.uinst
univention-run-join-scripts: runs all join scripts existing on local computer.
copyright © 2001-2019 Univention GmbH, Germany

Running pre-joinscripts hook(s): done
Running 00kopano4ucs-safemode-on.inst skipped (already executed)
Running 01univention-ldap-server-init.inst skipped (already executed)
Running 02univention-directory-notifier.inst skipped (already executed)
Running 03univention-directory-listener.inst skipped (already executed)
Running 04univention-ldap-client.inst skipped (already executed)
Running 05univention-bind.inst skipped (already executed)
Running 08univention-apache.inst skipped (already executed)
Running 10univention-ldap-server.inst skipped (already executed)
Running 11univention-heimdal-init.inst skipped (already executed)
Running 11univention-pam.inst skipped (already executed)
Running 15univention-directory-notifier-post.inst skipped (already executed)
Running 15univention-heimdal-kdc.inst skipped (already executed)
Running 18python-univention-directory-manager.inst skipped (already executed)
Running 20univention-directory-policy.inst skipped (already executed)
Running 20univention-join.inst skipped (already executed)
Running 26univention-nagios-common.inst skipped (already executed)
Running 30univention-appcenter.inst skipped (already executed)
Running 30univention-nagios-client.inst skipped (already executed)
Running 31univention-nagios-s4-connector.inst skipped (already executed)
Running 31univention-nagios-samba.inst skipped (already executed)
Running 33univention-portal.inst skipped (already executed)
Running 34univention-management-console-server.inst skipped (already executed)
Running 34univention-self-service.inst skipped (already executed)
Running 35univention-appcenter-docker.inst skipped (already executed)
Running 35univention-management-console-module-appcenter.inst skipped (already executed)
Running 35univention-management-console-module-diagnostic.inst skipped (already executed)
Running 35univention-management-console-module-ipchange.inst skipped (already executed)
Running 35univention-management-console-module-join.inst skipped (already executed)
Running 35univention-management-console-module-lib.inst skipped (already executed)
Running 35univention-management-console-module-mrtg.inst skipped (already executed)
Running 35univention-management-console-module-printers.inst skipped (already executed)
Running 35univention-management-console-module-quota.inst skipped (already executed)
Running 35univention-management-console-module-reboot.inst skipped (already executed)
Running 35univention-management-console-module-services.inst skipped (already executed)
Running 35univention-management-console-module-setup.inst skipped (already executed)
Running 35univention-management-console-module-sysinfo.inst skipped (already executed)
Running 35univention-management-console-module-top.inst skipped (already executed)
Running 35univention-management-console-module-ucr.inst skipped (already executed)
Running 35univention-management-console-module-udm.inst skipped (already executed)
Running 35univention-management-console-module-updater.inst skipped (already executed)
Running 35univention-nagios-cups.inst skipped (already executed)
Running 35univention-nagios-squid.inst skipped (already executed)
Running 35univention-self-service-passwordreset-umc.inst skipped (already executed)
Running 35univention-server-overview.inst skipped (already executed)
Running 36univention-management-console-module-apps.inst skipped (already executed)
Running 40univention-postgresql.inst skipped (already executed)
Running 40univention-virtual-machine-manager-schema.inst skipped (already executed)
Running 70kopano4ucs-udm.inst skipped (already executed)
Running 70kopano4ucs.inst skipped (already executed)
Running 71kopano4ucs-webapp.inst skipped (already executed)
Running 79univention-printserver.inst skipped (already executed)
Running 79univention-squid.inst skipped (already executed)
Running 81univention-nfs-server.inst skipped (already executed)
Running 90univention-bind-post.inst skipped (already executed)
Running 91univention-saml.inst skipped (already executed)
Running 92univention-management-console-web-server.inst skipped (already executed)
Running 96univention-samba4.inst skipped (already executed)
Running 97univention-s4-connector.inst skipped (already executed)
Running 98univention-pkgdb-tools.inst skipped (already executed)
Running 98univention-samba4-dns.inst skipped (already executed)
Running 98univention-samba4-saml-kerberos.inst skipped (already executed)
Running 99kopano4ucs-safemode-off.inst skipped (already executed)
Running 51nextcloud-uninstall.uinst failed (exitcode: 3)
Running post-joinscripts hook(s): done

The container for 4.1/nextcloud=16.0.4-0 could not be started!

docker logs f395183ad861a15e1dec03666b5ab8399df07c3f0baefe159d13311db4a7231a:

dockerd logs:
– Logs begin at Mon 2017-10-02 20:30:09 CEST, end at Tue 2019-09-24 06:58:20 CEST. –
Sep 23 23:08:44 svg-ucs1 dockerd[1708]: time=“2019-09-23T23:08:44.303408210+02:00” level=error msg=“Error setting up exec command in container ab58871d0d492c7f0758f8a1c8c7c71a9e7ff22acd94aa04f36ef887726ae635: Container ab58871d0d492c7f0758f8a1c8c7c71a9e7ff22acd94aa04f36ef887726ae635 is not running”
Sep 23 23:08:44 svg-ucs1 dockerd[1708]: time=“2019-09-23T23:08:44.303477684+02:00” level=error msg=“Handler for POST /v1.26/containers/ab58871d0d492c7f0758f8a1c8c7c71a9e7ff22acd94aa04f36ef887726ae635/exec returned error: Container ab58871d0d492c7f0758f8a1c8c7c71a9e7ff22acd94aa04f36ef887726ae635 is not running”
Sep 23 23:11:43 svg-ucs1 dockerd[1708]: time=“2019-09-23T23:11:43.896770259+02:00” level=info msg=“Container 5e28c22836dfca4b7491da727503410f9adf79698d3152316dc39e7c28936d73 failed to exit within 60 seconds of signal 15 - using the force”
Sep 23 23:11:44 svg-ucs1 dockerd[1708]: time=“2019-09-23T23:11:44.049932469+02:00” level=error msg=“Error running exec in container: rpc error: code = 2 desc = oci runtime error: exec failed: container_linux.go:247: starting container process caused “process_linux.go:83: executing setns process caused \“exit status 15\””\n”
Sep 23 23:11:48 svg-ucs1 dockerd[1708]: time=“2019-09-23T23:11:47.999941952+02:00” level=error msg=“Handler for POST /v1.26/containers/5e28c22836dfca4b7491da727503410f9adf79698d3152316dc39e7c28936d73/stop returned error: Container 5e28c22836dfca4b7491da727503410f9adf79698d3152316dc39e7c28936d73 is already stopped”
Sep 23 23:16:43 svg-ucs1 dockerd[1708]: time=“2019-09-23T23:16:43.739434848+02:00” level=error msg=“Error setting up exec command in container ab58871d0d492c7f0758f8a1c8c7c71a9e7ff22acd94aa04f36ef887726ae635: Container ab58871d0d492c7f0758f8a1c8c7c71a9e7ff22acd94aa04f36ef887726ae635 is not running”
Sep 23 23:16:43 svg-ucs1 dockerd[1708]: time=“2019-09-23T23:16:43.739500392+02:00” level=error msg=“Handler for POST /v1.26/containers/ab58871d0d492c7f0758f8a1c8c7c71a9e7ff22acd94aa04f36ef887726ae635/exec returned error: Container ab58871d0d492c7f0758f8a1c8c7c71a9e7ff22acd94aa04f36ef887726ae635 is not running”
Sep 23 23:19:39 svg-ucs1 dockerd[1708]: time=“2019-09-23T23:19:39.565193754+02:00” level=error msg=“Handler for POST /v1.26/containers/ab58871d0d49/stop returned error: Container ab58871d0d49 is already stopped”
Sep 23 23:28:41 svg-ucs1 dockerd[1708]: time=“2019-09-23T23:28:41.281054612+02:00” level=error msg=“Error setting up exec command in container ab58871d0d492c7f0758f8a1c8c7c71a9e7ff22acd94aa04f36ef887726ae635: Container ab58871d0d492c7f0758f8a1c8c7c71a9e7ff22acd94aa04f36ef887726ae635 is not running”
Sep 23 23:28:41 svg-ucs1 dockerd[1708]: time=“2019-09-23T23:28:41.281106021+02:00” level=error msg=“Handler for POST /v1.26/containers/ab58871d0d492c7f0758f8a1c8c7c71a9e7ff22acd94aa04f36ef887726ae635/exec returned error: Container ab58871d0d492c7f0758f8a1c8c7c71a9e7ff22acd94aa04f36ef887726ae635 is not running”
Sep 23 23:29:47 svg-ucs1 dockerd[1708]: time=“2019-09-23T23:29:47.415863983+02:00” level=error msg=“Handler for POST /v1.26/containers/?/start returned error: No such container: ?”
Sep 23 23:38:22 svg-ucs1 dockerd[1708]: time=“2019-09-23T23:38:22.569477628+02:00” level=error msg=“Handler for GET /v1.26/containers/ab58871d0d492c7f0758f8a1c8c7c71a9e7ff22acd94aa04f36ef887726ae635/json returned error: No such container: ab58871d0d492c7f0758f8a1c8c7c71a9e7ff22acd94aa04f36ef887726ae635”

docker inspect:
{u’Status’: u’exited’, u’Pid’: 0, u’OOMKilled’: False, u’Dead’: False, u’Paused’: False, u’Running’: False, u’FinishedAt’: u’2019-09-24T04:58:17.23683615Z’, u’Restarting’: False, u’Error’: u’’, u’StartedAt’: u’2019-09-24T04:58:17.060365063Z’, u’ExitCode’: 0}
{u’Data’: {u’MergedDir’: u’/var/lib/docker/overlay/17734ba92d26ebb14977a0172c49e57b5bc0502a227f1068f5eb70d21da47e27/merged’, u’WorkDir’: u’/var/lib/docker/overlay/17734ba92d26ebb14977a0172c49e57b5bc0502a227f1068f5eb70d21da47e27/work’, u’LowerDir’: u’/var/lib/docker/overlay/1360771b2d3ad1e22d5c9b7a69e151a0ec88fb32e0a54bfab902ab2ec10879f6/root’, u’UpperDir’: u’/var/lib/docker/overlay/17734ba92d26ebb14977a0172c49e57b5bc0502a227f1068f5eb70d21da47e27/upper’}, u’Name’: u’overlay’}
Traceback (most recent call last):
File “/usr/lib/python2.7/dist-packages/univention/appcenter/actions/init.py”, line 226, in call_with_namespace
result = self.main(namespace)
File “/usr/lib/python2.7/dist-packages/univention/appcenter/actions/install.py”, line 84, in main
return self.do_it(args)
File “/usr/lib/python2.7/dist-packages/univention/appcenter/actions/install_base.py”, line 119, in do_it
self._do_it(app, args)
File “/usr/lib/python2.7/dist-packages/univention/appcenter/actions/docker_install.py”, line 71, in _do_it
ret = super(Install, self)._do_it(app, args)
File “/usr/lib/python2.7/dist-packages/univention/appcenter/actions/install.py”, line 111, in _do_it
if self._install_app(app, args):
File “/usr/lib/python2.7/dist-packages/univention/appcenter/actions/docker_install.py”, line 65, in _install_app
self._start_docker_image(app, hostdn, password, args)
File “/usr/lib/python2.7/dist-packages/univention/appcenter/actions/docker_base.py”, line 244, in _start_docker_image
raise AppCenterErrorContainerStart(msg)
AppCenterErrorContainerStart:
The container for 4.1/nextcloud=16.0.4-0 could not be started!

docker logs f395183ad861a15e1dec03666b5ab8399df07c3f0baefe159d13311db4a7231a:

dockerd logs:
– Logs begin at Mon 2017-10-02 20:30:09 CEST, end at Tue 2019-09-24 06:58:20 CEST. –
Sep 23 23:08:44 svg-ucs1 dockerd[1708]: time=“2019-09-23T23:08:44.303408210+02:00” level=error msg=“Error setting up exec command in container ab58871d0d492c7f0758f8a1c8c7c71a9e7ff22acd94aa04f36ef887726ae635: Container ab58871d0d492c7f0758f8a1c8c7c71a9e7ff22acd94aa04f36ef887726ae635 is not running”
Sep 23 23:08:44 svg-ucs1 dockerd[1708]: time=“2019-09-23T23:08:44.303477684+02:00” level=error msg=“Handler for POST /v1.26/containers/ab58871d0d492c7f0758f8a1c8c7c71a9e7ff22acd94aa04f36ef887726ae635/exec returned error: Container ab58871d0d492c7f0758f8a1c8c7c71a9e7ff22acd94aa04f36ef887726ae635 is not running”
Sep 23 23:11:43 svg-ucs1 dockerd[1708]: time=“2019-09-23T23:11:43.896770259+02:00” level=info msg=“Container 5e28c22836dfca4b7491da727503410f9adf79698d3152316dc39e7c28936d73 failed to exit within 60 seconds of signal 15 - using the force”
Sep 23 23:11:44 svg-ucs1 dockerd[1708]: time=“2019-09-23T23:11:44.049932469+02:00” level=error msg=“Error running exec in container: rpc error: code = 2 desc = oci runtime error: exec failed: container_linux.go:247: starting container process caused “process_linux.go:83: executing setns process caused \“exit status 15\””\n”
Sep 23 23:11:48 svg-ucs1 dockerd[1708]: time=“2019-09-23T23:11:47.999941952+02:00” level=error msg=“Handler for POST /v1.26/containers/5e28c22836dfca4b7491da727503410f9adf79698d3152316dc39e7c28936d73/stop returned error: Container 5e28c22836dfca4b7491da727503410f9adf79698d3152316dc39e7c28936d73 is already stopped”
Sep 23 23:16:43 svg-ucs1 dockerd[1708]: time=“2019-09-23T23:16:43.739434848+02:00” level=error msg=“Error setting up exec command in container ab58871d0d492c7f0758f8a1c8c7c71a9e7ff22acd94aa04f36ef887726ae635: Container ab58871d0d492c7f0758f8a1c8c7c71a9e7ff22acd94aa04f36ef887726ae635 is not running”
Sep 23 23:16:43 svg-ucs1 dockerd[1708]: time=“2019-09-23T23:16:43.739500392+02:00” level=error msg=“Handler for POST /v1.26/containers/ab58871d0d492c7f0758f8a1c8c7c71a9e7ff22acd94aa04f36ef887726ae635/exec returned error: Container ab58871d0d492c7f0758f8a1c8c7c71a9e7ff22acd94aa04f36ef887726ae635 is not running”
Sep 23 23:19:39 svg-ucs1 dockerd[1708]: time=“2019-09-23T23:19:39.565193754+02:00” level=error msg=“Handler for POST /v1.26/containers/ab58871d0d49/stop returned error: Container ab58871d0d49 is already stopped”
Sep 23 23:28:41 svg-ucs1 dockerd[1708]: time=“2019-09-23T23:28:41.281054612+02:00” level=error msg=“Error setting up exec command in container ab58871d0d492c7f0758f8a1c8c7c71a9e7ff22acd94aa04f36ef887726ae635: Container ab58871d0d492c7f0758f8a1c8c7c71a9e7ff22acd94aa04f36ef887726ae635 is not running”
Sep 23 23:28:41 svg-ucs1 dockerd[1708]: time=“2019-09-23T23:28:41.281106021+02:00” level=error msg=“Handler for POST /v1.26/containers/ab58871d0d492c7f0758f8a1c8c7c71a9e7ff22acd94aa04f36ef887726ae635/exec returned error: Container ab58871d0d492c7f0758f8a1c8c7c71a9e7ff22acd94aa04f36ef887726ae635 is not running”
Sep 23 23:29:47 svg-ucs1 dockerd[1708]: time=“2019-09-23T23:29:47.415863983+02:00” level=error msg=“Handler for POST /v1.26/containers/?/start returned error: No such container: ?”
Sep 23 23:38:22 svg-ucs1 dockerd[1708]: time=“2019-09-23T23:38:22.569477628+02:00” level=error msg=“Handler for GET /v1.26/containers/ab58871d0d492c7f0758f8a1c8c7c71a9e7ff22acd94aa04f36ef887726ae635/json returned error: No such container: ab58871d0d492c7f0758f8a1c8c7c71a9e7ff22acd94aa04f36ef887726ae635”

docker inspect:
{u’Status’: u’exited’, u’Pid’: 0, u’OOMKilled’: False, u’Dead’: False, u’Paused’: False, u’Running’: False, u’FinishedAt’: u’2019-09-24T04:58:17.23683615Z’, u’Restarting’: False, u’Error’: u’’, u’StartedAt’: u’2019-09-24T04:58:17.060365063Z’, u’ExitCode’: 0}
{u’Data’: {u’MergedDir’: u’/var/lib/docker/overlay/17734ba92d26ebb14977a0172c49e57b5bc0502a227f1068f5eb70d21da47e27/merged’, u’WorkDir’: u’/var/lib/docker/overlay/17734ba92d26ebb14977a0172c49e57b5bc0502a227f1068f5eb70d21da47e27/work’, u’LowerDir’: u’/var/lib/docker/overlay/1360771b2d3ad1e22d5c9b7a69e151a0ec88fb32e0a54bfab902ab2ec10879f6/root’, u’UpperDir’: u’/var/lib/docker/overlay/17734ba92d26ebb14977a0172c49e57b5bc0502a227f1068f5eb70d21da47e27/upper’}, u’Name’: u’overlay’}
Traceback (most recent call last):
File “/usr/bin/univention-app”, line 91, in
main()
File “/usr/bin/univention-app”, line 78, in main
ret = args.func(args)
File “/usr/lib/python2.7/dist-packages/univention/appcenter/actions/init.py”, line 226, in call_with_namespace
result = self.main(namespace)
File “/usr/lib/python2.7/dist-packages/univention/appcenter/actions/install.py”, line 84, in main
return self.do_it(args)
File “/usr/lib/python2.7/dist-packages/univention/appcenter/actions/install_base.py”, line 119, in do_it
self._do_it(app, args)
File “/usr/lib/python2.7/dist-packages/univention/appcenter/actions/docker_install.py”, line 71, in _do_it
ret = super(Install, self)._do_it(app, args)
File “/usr/lib/python2.7/dist-packages/univention/appcenter/actions/install.py”, line 111, in _do_it
if self._install_app(app, args):
File “/usr/lib/python2.7/dist-packages/univention/appcenter/actions/docker_install.py”, line 65, in _install_app
self._start_docker_image(app, hostdn, password, args)
File “/usr/lib/python2.7/dist-packages/univention/appcenter/actions/docker_base.py”, line 244, in _start_docker_image
raise AppCenterErrorContainerStart(msg)
univention.appcenter.exceptions.AppCenterErrorContainerStart:
The container for 4.1/nextcloud=16.0.4-0 could not be started!

docker logs f395183ad861a15e1dec03666b5ab8399df07c3f0baefe159d13311db4a7231a:

dockerd logs:
– Logs begin at Mon 2017-10-02 20:30:09 CEST, end at Tue 2019-09-24 06:58:20 CEST. –
Sep 23 23:08:44 svg-ucs1 dockerd[1708]: time=“2019-09-23T23:08:44.303408210+02:00” level=error msg=“Error setting up exec command in container ab58871d0d492c7f0758f8a1c8c7c71a9e7ff22acd94aa04f36ef887726ae635: Container ab58871d0d492c7f0758f8a1c8c7c71a9e7ff22acd94aa04f36ef887726ae635 is not running”
Sep 23 23:08:44 svg-ucs1 dockerd[1708]: time=“2019-09-23T23:08:44.303477684+02:00” level=error msg=“Handler for POST /v1.26/containers/ab58871d0d492c7f0758f8a1c8c7c71a9e7ff22acd94aa04f36ef887726ae635/exec returned error: Container ab58871d0d492c7f0758f8a1c8c7c71a9e7ff22acd94aa04f36ef887726ae635 is not running”
Sep 23 23:11:43 svg-ucs1 dockerd[1708]: time=“2019-09-23T23:11:43.896770259+02:00” level=info msg=“Container 5e28c22836dfca4b7491da727503410f9adf79698d3152316dc39e7c28936d73 failed to exit within 60 seconds of signal 15 - using the force”
Sep 23 23:11:44 svg-ucs1 dockerd[1708]: time=“2019-09-23T23:11:44.049932469+02:00” level=error msg=“Error running exec in container: rpc error: code = 2 desc = oci runtime error: exec failed: container_linux.go:247: starting container process caused “process_linux.go:83: executing setns process caused \“exit status 15\””\n”
Sep 23 23:11:48 svg-ucs1 dockerd[1708]: time=“2019-09-23T23:11:47.999941952+02:00” level=error msg=“Handler for POST /v1.26/containers/5e28c22836dfca4b7491da727503410f9adf79698d3152316dc39e7c28936d73/stop returned error: Container 5e28c22836dfca4b7491da727503410f9adf79698d3152316dc39e7c28936d73 is already stopped”
Sep 23 23:16:43 svg-ucs1 dockerd[1708]: time=“2019-09-23T23:16:43.739434848+02:00” level=error msg=“Error setting up exec command in container ab58871d0d492c7f0758f8a1c8c7c71a9e7ff22acd94aa04f36ef887726ae635: Container ab58871d0d492c7f0758f8a1c8c7c71a9e7ff22acd94aa04f36ef887726ae635 is not running”
Sep 23 23:16:43 svg-ucs1 dockerd[1708]: time=“2019-09-23T23:16:43.739500392+02:00” level=error msg=“Handler for POST /v1.26/containers/ab58871d0d492c7f0758f8a1c8c7c71a9e7ff22acd94aa04f36ef887726ae635/exec returned error: Container ab58871d0d492c7f0758f8a1c8c7c71a9e7ff22acd94aa04f36ef887726ae635 is not running”
Sep 23 23:19:39 svg-ucs1 dockerd[1708]: time=“2019-09-23T23:19:39.565193754+02:00” level=error msg=“Handler for POST /v1.26/containers/ab58871d0d49/stop returned error: Container ab58871d0d49 is already stopped”
Sep 23 23:28:41 svg-ucs1 dockerd[1708]: time=“2019-09-23T23:28:41.281054612+02:00” level=error msg=“Error setting up exec command in container ab58871d0d492c7f0758f8a1c8c7c71a9e7ff22acd94aa04f36ef887726ae635: Container ab58871d0d492c7f0758f8a1c8c7c71a9e7ff22acd94aa04f36ef887726ae635 is not running”
Sep 23 23:28:41 svg-ucs1 dockerd[1708]: time=“2019-09-23T23:28:41.281106021+02:00” level=error msg=“Handler for POST /v1.26/containers/ab58871d0d492c7f0758f8a1c8c7c71a9e7ff22acd94aa04f36ef887726ae635/exec returned error: Container ab58871d0d492c7f0758f8a1c8c7c71a9e7ff22acd94aa04f36ef887726ae635 is not running”
Sep 23 23:29:47 svg-ucs1 dockerd[1708]: time=“2019-09-23T23:29:47.415863983+02:00” level=error msg=“Handler for POST /v1.26/containers/?/start returned error: No such container: ?”
Sep 23 23:38:22 svg-ucs1 dockerd[1708]: time=“2019-09-23T23:38:22.569477628+02:00” level=error msg=“Handler for GET /v1.26/containers/ab58871d0d492c7f0758f8a1c8c7c71a9e7ff22acd94aa04f36ef887726ae635/json returned error: No such container: ab58871d0d492c7f0758f8a1c8c7c71a9e7ff22acd94aa04f36ef887726ae635”

docker inspect:
{u’Status’: u’exited’, u’Pid’: 0, u’OOMKilled’: False, u’Dead’: False, u’Paused’: False, u’Running’: False, u’FinishedAt’: u’2019-09-24T04:58:17.23683615Z’, u’Restarting’: False, u’Error’: u’’, u’StartedAt’: u’2019-09-24T04:58:17.060365063Z’, u’ExitCode’: 0}
{u’Data’: {u’MergedDir’: u’/var/lib/docker/overlay/17734ba92d26ebb14977a0172c49e57b5bc0502a227f1068f5eb70d21da47e27/merged’, u’WorkDir’: u’/var/lib/docker/overlay/17734ba92d26ebb14977a0172c49e57b5bc0502a227f1068f5eb70d21da47e27/work’, u’LowerDir’: u’/var/lib/docker/overlay/1360771b2d3ad1e22d5c9b7a69e151a0ec88fb32e0a54bfab902ab2ec10879f6/root’, u’UpperDir’: u’/var/lib/docker/overlay/17734ba92d26ebb14977a0172c49e57b5bc0502a227f1068f5eb70d21da47e27/upper’}, u’Name’: u’overlay’}
root@svg-ucs1:~#

----------snip---------------

Hallo zusammen,

wenn ich Nextcloud versuche erneut zu installieren (SSH console, dann “univention-app install nextcloud” …) ergibt sich unter anderem folgender Meldungsstrang:
-----------snip---------
docker inspect:
{u’Status’: u’exited’, u’Pid’: 0, u’OOMKilled’: False, u’Dead’: False, u’Paused’: False, u’Running’: False, u’FinishedAt’: u’2019-09-24T16:02:18.51894298Z’, u’Restarting’: False, u’Error’: u’’, u’StartedAt’: u’2019-09-24T16:02:18.391971657Z’, u’ExitCode’: 0}
{u’Data’: {u’MergedDir’: u’/var/lib/docker/overlay/5370ff0873c4017f00efc88756e439f9fd5742d429fc048e6a72b322046739ef/merged’, u’WorkDir’: u’/var/lib/docker/overlay/5370ff0873c4017f00efc88756e439f9fd5742d429fc048e6a72b322046739ef/work’, u’LowerDir’: u’/var/lib/docker/overlay/1360771b2d3ad1e22d5c9b7a69e151a0ec88fb32e0a54bfab902ab2ec10879f6/root’, u’UpperDir’: u’/var/lib/docker/overlay/5370ff0873c4017f00efc88756e439f9fd5742d429fc048e6a72b322046739ef/upper’}, u’Name’: u’overlay’}
Traceback (most recent call last):
File “/usr/bin/univention-app”, line 91, in
main()
File “/usr/bin/univention-app”, line 78, in main
ret = args.func(args)
File “/usr/lib/python2.7/dist-packages/univention/appcenter/actions/init.py”, line 226, in call_with_namespace
result = self.main(namespace)
File “/usr/lib/python2.7/dist-packages/univention/appcenter/actions/install.py”, line 84, in main
return self.do_it(args)
File “/usr/lib/python2.7/dist-packages/univention/appcenter/actions/install_base.py”, line 119, in do_it
self._do_it(app, args)
File “/usr/lib/python2.7/dist-packages/univention/appcenter/actions/docker_install.py”, line 71, in _do_it
ret = super(Install, self)._do_it(app, args)
File “/usr/lib/python2.7/dist-packages/univention/appcenter/actions/install.py”, line 111, in _do_it
if self._install_app(app, args):
File “/usr/lib/python2.7/dist-packages/univention/appcenter/actions/docker_install.py”, line 65, in _install_app
self._start_docker_image(app, hostdn, password, args)
File “/usr/lib/python2.7/dist-packages/univention/appcenter/actions/docker_base.py”, line 244, in _start_docker_image
raise AppCenterErrorContainerStart(msg)
univention.appcenter.exceptions.AppCenterErrorContainerStart:
The container for 4.1/nextcloud=16.0.4-0 could not be started!

docker logs ff4bf1384ff3c2798203f52ca53d9829792f4d5858d2915bc53b92c3455fa820:

dockerd logs:
– Logs begin at Mon 2017-10-02 20:30:09 CEST, end at Tue 2019-09-24 18:02:19 CEST. –
Sep 24 14:05:57 svg-ucs1 dockerd[1624]: time=“2019-09-24T14:05:57.622357491+02:00” level=info msg=“Daemon has completed initialization”
Sep 24 14:05:57 svg-ucs1 dockerd[1624]: time=“2019-09-24T14:05:57.622405582+02:00” level=info msg=“Docker daemon” commit=092cba3 graphdriver=overlay version=1.13.1
Sep 24 14:05:57 svg-ucs1 dockerd[1624]: time=“2019-09-24T14:05:57.637152997+02:00” level=info msg=“API listen on /var/run/docker.sock”
Sep 24 14:25:05 svg-ucs1 dockerd[1624]: time=“2019-09-24T14:25:05.192460324+02:00” level=warning msg=“failed to retrieve docker-init version: unknown output format: tini version 0.13.0\n”
Sep 24 14:25:33 svg-ucs1 dockerd[1624]: time=“2019-09-24T14:25:33.024793186+02:00” level=error msg=“Handler for POST /v1.26/containers/9218809fc9d74d0a3617522ed33f3631efbb830faa33001fa9ccf9264975c465/stop returned error: Container 9218809fc9d74d0a3617522ed33f3631efbb830faa33001fa9ccf9264975c465 is already stopped”
Sep 24 17:55:11 svg-ucs1 dockerd[1624]: time=“2019-09-24T17:55:11.775484899+02:00” level=info msg=“Processing signal ‘terminated’”
Sep 24 17:55:11 svg-ucs1 dockerd[1624]: time=“2019-09-24T17:55:11.834969693+02:00” level=info msg=“stopping containerd after receiving terminated”
– Reboot –
Sep 24 17:58:03 svg-ucs1 dockerd[1621]: time=“2019-09-24T17:58:03.947472746+02:00” level=info msg=“libcontainerd: new containerd process, pid: 1832”
Sep 24 17:58:07 svg-ucs1 dockerd[1621]: time=“2019-09-24T17:58:07.768752462+02:00” level=info msg=“Graph migration to content-addressability took 0.01 seconds”
Sep 24 17:58:07 svg-ucs1 dockerd[1621]: time=“2019-09-24T17:58:07.769379068+02:00” level=warning msg=“Your kernel does not support swap memory limit”

docker inspect:
{u’Status’: u’exited’, u’Pid’: 0, u’OOMKilled’: False, u’Dead’: False, u’Paused’: False, u’Running’: False, u’FinishedAt’: u’2019-09-24T16:02:18.51894298Z’, u’Restarting’: False, u’Error’: u’’, u’StartedAt’: u’2019-09-24T16:02:18.391971657Z’, u’ExitCode’: 0}
{u’Data’: {u’MergedDir’: u’/var/lib/docker/overlay/5370ff0873c4017f00efc88756e439f9fd5742d429fc048e6a72b322046739ef/merged’, u’WorkDir’: u’/var/lib/docker/overlay/5370ff0873c4017f00efc88756e439f9fd5742d429fc048e6a72b322046739ef/work’, u’LowerDir’: u’/var/lib/docker/overlay/1360771b2d3ad1e22d5c9b7a69e151a0ec88fb32e0a54bfab902ab2ec10879f6/root’, u’UpperDir’: u’/var/lib/docker/overlay/5370ff0873c4017f00efc88756e439f9fd5742d429fc048e6a72b322046739ef/upper’}, u’Name’: u’overlay’}
-----snip---------
hat jemand Ideen was da falsch läuft?

Grüsse
Stephan von Gehlen